BDBM50082042 CHEMBL139536::N-(2,2,4,4-Tetramethyl-thiochroman-6-yl)-terephthalamic acid methyl ester
SMILES COC(=O)c1ccc(cc1)C(=O)Nc1ccc2SC(C)(C)CC(C)(C)c2c1
InChI Key InChIKey=JZHWLPKXASYCHY-UHFFFAOYSA-N
Data  6 EC50
  Tab Delimited (TSV)   2D SDfile   Computed 3D by Vconf -m prep SDfile
Find this compound or compounds like it in BindingDB:
Activity Spreadsheet -- Enzyme Inhibition Constant Data from BindingDB
Found 6 hits for monomerid = 50082042
TargetRetinoic acid receptor RXR-gamma(Mus musculus)
University Of Oklahoma Health Sciences Center
Curated by ChEMBL
LigandPNGBDBM50082042(CHEMBL139536 | N-(2,2,4,4-Tetramethyl-thiochroman-...)
Affinity DataEC50:  302nM. Assay description: Transcriptional activation of CV-1 cells expressing murine Retinoid X receptor RXR gamma
In DepthDetails ArticlePubMed
TargetRetinoic acid receptor gamma(Homo sapiens (Human))
University Of Oklahoma Health Sciences Center
Curated by ChEMBL
LigandPNGBDBM50082042(CHEMBL139536 | N-(2,2,4,4-Tetramethyl-thiochroman-...)
Affinity DataEC50:  152nM. Assay description: Transcriptional activation in CV-1 cells expressing human Retinoic acid receptor RAR gamma
In DepthDetails ArticlePubMed
TargetRetinoic acid receptor beta(Homo sapiens (Human))
University Of Oklahoma Health Sciences Center
Curated by ChEMBL
LigandPNGBDBM50082042(CHEMBL139536 | N-(2,2,4,4-Tetramethyl-thiochroman-...)
Affinity DataEC50:  1.00E+3nM. Assay description: Transcriptional activation in CV-1 cells expressing human Retinoic acid receptor RAR beta
In DepthDetails ArticlePubMed
TargetRetinoic acid receptor RXR-alpha(Mus musculus)
University Of Oklahoma Health Sciences Center
Curated by ChEMBL
LigandPNGBDBM50082042(CHEMBL139536 | N-(2,2,4,4-Tetramethyl-thiochroman-...)
Affinity DataEC50:  84nM. Assay description: Transcriptional activation of CV-1 cells expressing murine Retinoid X receptor RXR alpha
In DepthDetails ArticlePubMed
TargetRetinoic acid receptor RXR-beta(Mus musculus)
University Of Oklahoma Health Sciences Center
Curated by ChEMBL
LigandPNGBDBM50082042(CHEMBL139536 | N-(2,2,4,4-Tetramethyl-thiochroman-...)
Affinity DataEC50:  68nM. Assay description: Transcriptional activation of CV-1 cells expressing murine Retinoid X receptor RXR beta
In DepthDetails ArticlePubMed
TargetRetinoic acid receptor alpha(Homo sapiens (Human))
University Of Oklahoma Health Sciences Center
Curated by ChEMBL
LigandPNGBDBM50082042(CHEMBL139536 | N-(2,2,4,4-Tetramethyl-thiochroman-...)
Affinity DataEC50:  225nM. Assay description: Transcriptional activation in CV-1 cells expressing human Retinoic acid receptor RAR alpha
In DepthDetails ArticlePubMed