BDBM50085876 2-{4-[2-Acetylamino-2-(1-{2-carbamoyl-1-[3-(5-methyl-indol-1-yl)-propylcarbamoyl]-ethylcarbamoyl}-cyclohexylcarbamoyl)-ethyl]-phenyl}-malonic acid::CHEMBL368263
SMILES CC(=O)N[C@@H](Cc1ccc(cc1)C(C(O)=O)C(O)=O)C(=O)NC1(CCCCC1)C(=O)N[C@@H](CC(N)=O)C(=O)NCCCn1ccc2cc(C)ccc12
InChI Key InChIKey=JJOFUDMITTWTMS-NSOVKSMOSA-N
Data  1 IC50
  Tab Delimited (TSV)   2D SDfile   Computed 3D by Vconf -m prep SDfile
Find this compound or compounds like it in BindingDB:
Activity Spreadsheet -- Enzyme Inhibition Constant Data from BindingDB
Found 1 hit for monomerid = 50085876
TargetGrowth factor receptor-bound protein 2(Homo sapiens (Human))
National Cancer Institute-Bethesda
Curated by ChEMBL
LigandPNGBDBM50085876(2-{4-[2-Acetylamino-2-(1-{2-carbamoyl-1-[3-(5-meth...)
Affinity DataIC50:  12nM. Assay description: Inhibition of Growth factor receptor bound protein 2 binding by ELISA assay method
In DepthDetails ArticlePubMed