BDBM50087309 2-(3-Bromo-benzyl)-6-(8-hydroxy-7,8-dihydro-6H-imidazo[4,5-d][1,3]diazepin-3-yl)-hexanoic acid ethyl ester::CHEMBL289823
SMILES CCOC(=O)C(CCCCn1cnc2C(O)CNC=Nc12)Cc1cccc(Br)c1
InChI Key InChIKey=XIRHWMQXMARTED-UHFFFAOYSA-N
Data  2 KI
  Tab Delimited (TSV)   2D SDfile   Computed 3D by Vconf -m prep SDfile
Find this compound or compounds like it in BindingDB:
Activity Spreadsheet -- Enzyme Inhibition Constant Data from BindingDB
Found 2 hits for monomerid = 50087309
TargetAMP deaminase 2(Homo sapiens (Human))
Metabasis Therapeutics
Curated by ChEMBL
LigandPNGBDBM50087309(2-(3-Bromo-benzyl)-6-(8-hydroxy-7,8-dihydro-6H-imi...)
Affinity DataKi:  3.80E+3nM. Assay description: Evaluated for the inhibition of porcine heart or human L-type Adenosine 5'-monophosphate deaminase (AMPDA)
In DepthDetails ArticlePubMed
TargetAdenosine deaminase(Bos taurus (bovine))
Metabasis Therapeutics
Curated by ChEMBL
LigandPNGBDBM50087309(2-(3-Bromo-benzyl)-6-(8-hydroxy-7,8-dihydro-6H-imi...)
Affinity DataKi: >7.50E+3nM. Assay description: Evaluated for the inhibition of calf intestinal Adenosine deaminase (ADA)
In DepthDetails ArticlePubMed