BDBM50087323 5-(8-Hydroxy-7,8-dihydro-6H-imidazo[4,5-d][1,3]diazepin-3-yl)-pentanenitrile::CHEMBL35156
SMILES OC1CNC=Nc2c1ncn2CCCCC#N
InChI Key InChIKey=CECSSKSYNCYPBU-UHFFFAOYSA-N
Data  2 KI
  Tab Delimited (TSV)   2D SDfile   Computed 3D by Vconf -m prep SDfile
Find this compound or compounds like it in BindingDB:
Activity Spreadsheet -- Enzyme Inhibition Constant Data from BindingDB
Found 2 hits for monomerid = 50087323
TargetAdenosine deaminase(Bos taurus (bovine))
Metabasis Therapeutics
Curated by ChEMBL
LigandPNGBDBM50087323(5-(8-Hydroxy-7,8-dihydro-6H-imidazo[4,5-d][1,3]dia...)
Affinity DataKi:  1.40E+4nM. Assay description: Evaluated for the inhibition of calf intestinal Adenosine deaminase (ADA)
In DepthDetails ArticlePubMed
TargetAMP deaminase 2(Homo sapiens (Human))
Metabasis Therapeutics
Curated by ChEMBL
LigandPNGBDBM50087323(5-(8-Hydroxy-7,8-dihydro-6H-imidazo[4,5-d][1,3]dia...)
Affinity DataKi:  2.40E+5nM. Assay description: Evaluated for the inhibition of porcine heart or human L-type Adenosine 5'-monophosphate deaminase (AMPDA)
In DepthDetails ArticlePubMed