BDBM50091749 CHEMBL412793::Cyclic-(Cys-Phe-Gly-Gly-Arg-Ala-Asp-Arg-Ile-Gly-Ala-Gln-Ser-Gly-Leu-Gly-Cys)
SMILES CC[C@H](C)[C@@H]1NC(=O)[C@H](CCCNC(N)=N)NC(=O)[C@H](CC(O)=O)NC(=O)[C@H](C)NC(=O)[C@H](CCCNC(N)=N)NC(=O)CNC(=O)CNC(=O)[C@H](Cc2ccccc2)NC(=O)[C@H](N)CSSC[C@@H](NC(=O)CNC(=O)[C@H](CC(C)C)NC(=O)CNC(=O)[C@H](CO)NC(=O)[C@H](CCC(N)=O)NC(=O)[C@H](C)NC(=O)CNC1=O)C(O)=O
InChI Key InChIKey=MCHMSEFZIGFZBO-BZZMOAOGSA-N
Data  2 KI
  Tab Delimited (TSV)   2D SDfile   Computed 3D by Vconf -m prep SDfile
Find this compound or compounds like it in BindingDB:
Activity Spreadsheet -- Enzyme Inhibition Constant Data from BindingDB
Found 2 hits for monomerid = 50091749
TargetAtrial natriuretic peptide receptor 1(Homo sapiens (Human))
Astrazeneca Pharmaceuticals
Curated by ChEMBL
LigandPNGBDBM50091749(CHEMBL412793 | Cyclic-(Cys-Phe-Gly-Gly-Arg-Ala-Asp...)
Affinity DataKi:  360nM. Assay description: Displacement of [125I]- ANP from the Atrial natriuretic peptide receptor A.
In DepthDetails ArticlePubMed
TargetAtrial natriuretic peptide receptor 3(Homo sapiens (Human))
Astrazeneca Pharmaceuticals
Curated by ChEMBL
LigandPNGBDBM50091749(CHEMBL412793 | Cyclic-(Cys-Phe-Gly-Gly-Arg-Ala-Asp...)
Affinity DataKi:  360nM. Assay description: Displacement of [125I]- ANP from the Atrial Natriuretic Peptide Clearance Receptor.
In DepthDetails ArticlePubMed