BDBM50119406 CHEMBL3613833
SMILES CC[NH+](CC)CC.[H][C@]12CS[C@@H](CCCCC(=O)[N-]S(=O)(=O)NC[C@H]3O[C@H]([C@@H](N=[N+]=[N-])[C@@H]3O)n3cnc4c(N)ncnc34)[C@@]1([H])NC(=O)N2
InChI Key InChIKey=ZDHLWWFHXBIJLN-GEJZKSIJSA-N
Data  1 Kd
  Tab Delimited (TSV)   2D SDfile   Computed 3D by Vconf -m prep SDfile
Find this compound or compounds like it in BindingDB:
Activity Spreadsheet -- Enzyme Inhibition Constant Data from BindingDB
Found 1 hit for monomerid = 50119406
TargetBiotin--[biotin carboxyl-carrier protein] ligase(Mycobacterium tuberculosis (strain CDC 1551 / Oshk...)
University Of Minnesota
Curated by ChEMBL
LigandPNGBDBM50119406(CHEMBL3613833)
Affinity DataKd:  0.0270nM. Assay description: Binding affinity to Mycobacterium tuberculosis H37Rv Biotin protein ligase expressed in Escherichia coli by ITC analysis
In DepthDetails ArticlePubMed