BDBM50120700 6-Oxo-3,4,5,6-tetrahydro-1H-azepino[5,4,3-cd]indole-2-carboxylic acid phenylamide::CHEMBL344113
SMILES O=C(Nc1ccccc1)c1[nH]c2cccc3C(=O)NCCc1c23
InChI Key InChIKey=QKNOJBQUFNZCJE-UHFFFAOYSA-N
Data  1 KI
  Tab Delimited (TSV)   2D SDfile   Computed 3D by Vconf -m prep SDfile
Find this compound or compounds like it in BindingDB:
Activity Spreadsheet -- Enzyme Inhibition Constant Data from BindingDB
Found 1 hit for monomerid = 50120700
TargetPoly [ADP-ribose] polymerase 1(Homo sapiens (Human))
Pfizer
Curated by ChEMBL
LigandPNGBDBM50120700(6-Oxo-3,4,5,6-tetrahydro-1H-azepino[5,4,3-cd]indol...)
Affinity DataKi:  10nM. Assay description: In vitro inhibitory activity towards human poly(ADP-ribose) polymerase 1 (PARP-1).
In DepthDetails ArticlePubMed