BDBM50151245 CHEMBL1229516
SMILES CNC(=O)[C@@H](NC(=O)[C@H](CCCc1ccccc1)[C@H](C)N(O)C=O)C(C)(C)C
InChI Key InChIKey=GHVMTHKJUAOZJP-CGTJXYLNSA-N
Data  17 IC50
PDB links: 3 PDB IDs match this monomer.
  Tab Delimited (TSV)   2D SDfile   Computed 3D by Vconf -m prep SDfile
Find this compound or compounds like it in BindingDB:
Activity Spreadsheet -- Enzyme Inhibition Constant Data from BindingDB
Found 17 hits for monomerid = 50151245
TargetDisintegrin and metalloproteinase domain-containing protein 10(Homo sapiens (Human))
San Raffaele Scientific Institute
Curated by ChEMBL
LigandPNGBDBM50151245(CHEMBL1229516)
Affinity DataIC50:  1.00E+4nM. Assay description: Inhibition of ADAM-10 in human KM-H2 cells assessed as reduction in pervanadate-induced TNFalpha shedding after 24 hrs by ELISA
In DepthDetails ArticlePubMed
TargetDisintegrin and metalloproteinase domain-containing protein 10(Homo sapiens (Human))
San Raffaele Scientific Institute
Curated by ChEMBL
LigandPNGBDBM50151245(CHEMBL1229516)
Affinity DataIC50:  7.00E+3nM. Assay description: Inhibition of ADAM-10 in human L540 cells assessed as reduction in pervanadate-induced TNFalpha shedding after 24 hrs by ELISA
In DepthDetails ArticlePubMed
TargetDisintegrin and metalloproteinase domain-containing protein 10(Homo sapiens (Human))
San Raffaele Scientific Institute
Curated by ChEMBL
LigandPNGBDBM50151245(CHEMBL1229516)
Affinity DataIC50:  1.00E+4nM. Assay description: Inhibition of ADAM-10 in human KM-H2 cells assessed as reduction in pervanadate-induced soluble ULBP3 shedding after 24 hrs by ELISA
In DepthDetails ArticlePubMed
TargetInterstitial collagenase(Homo sapiens (Human))
San Raffaele Scientific Institute
Curated by ChEMBL
LigandPNGBDBM50151245(CHEMBL1229516)
Affinity DataIC50:  125nM. Assay description: Inhibition of human MMP-1 using Mca-Lys-Pro-Leu-Gly-Leu-Dap(Dnp)-Ala-Arg-NH2 as substrate after 3 hrs by fluorometric assay
In DepthDetails ArticlePubMed
Target72 kDa type IV collagenase(Homo sapiens (Human))
San Raffaele Scientific Institute
Curated by ChEMBL
LigandPNGBDBM50151245(CHEMBL1229516)
Affinity DataIC50:  2.10nM. Assay description: Inhibition of recombinant human MMP-2 using Mca-Lys-Pro-Leu-Gly-Leu-Dap(Dnp)-Ala-Arg-NH2 as substrate after 3 hrs by fluorometric assay
In DepthDetails ArticlePubMed
TargetMatrix metalloproteinase-9(Homo sapiens (Human))
San Raffaele Scientific Institute
Curated by ChEMBL
LigandPNGBDBM50151245(CHEMBL1229516)
Affinity DataIC50:  5.10nM. Assay description: Inhibition of recombinant human MMP-9 using Mca-Lys-Pro-Leu-Gly-Leu-Dap(Dnp)-Ala-Arg-NH2 as substrate after 3 hrs by fluorometric assay
In DepthDetails ArticlePubMed
TargetMatrix metalloproteinase-14(Homo sapiens (Human))
San Raffaele Scientific Institute
Curated by ChEMBL
LigandPNGBDBM50151245(CHEMBL1229516)
Affinity DataIC50:  88nM. Assay description: Inhibition of recombinant human MMP-14 using Mca-Lys-Pro-Leu-Gly-Leu-Dap(Dnp)-Ala-Arg-NH2 as substrate after 3 hrs by fluorometric assay
In DepthDetails ArticlePubMed
TargetDisintegrin and metalloproteinase domain-containing protein 17(Homo sapiens (Human))
San Raffaele Scientific Institute
Curated by ChEMBL
LigandPNGBDBM50151245(CHEMBL1229516)
Affinity DataIC50:  860nM. Assay description: Inhibition of recombinant human ADAM-17 using Mca-Lys-Pro-Leu-Gly-Leu-Dap(Dnp)-Ala-Arg-NH2 as substrate after 30 mins by fluorometric assay
In DepthDetails ArticlePubMed
TargetDisintegrin and metalloproteinase domain-containing protein 10(Homo sapiens (Human))
San Raffaele Scientific Institute
Curated by ChEMBL
LigandPNGBDBM50151245(CHEMBL1229516)
Affinity DataIC50:  27nM. Assay description: Inhibition of recombinant human ADAM-10 using Mca-Lys-Pro-Leu-Gly-Leu-Dap(Dnp)-Ala-Arg-NH2 as substrate after 1 hr by fluorometric assay
In DepthDetails ArticlePubMed
TargetDisintegrin and metalloproteinase domain-containing protein 17(Homo sapiens (Human))
San Raffaele Scientific Institute
Curated by ChEMBL
LigandPNGBDBM50151245(CHEMBL1229516)
Affinity DataIC50:  1.00E+4nM. Assay description: Inhibition of ADAM-17 in human KM-H2 cells assessed as reduction in pervanadate-induced soluble ALCAM shedding after 24 hrs by ELISA
In DepthDetails ArticlePubMed
TargetDisintegrin and metalloproteinase domain-containing protein 10(Homo sapiens (Human))
San Raffaele Scientific Institute
Curated by ChEMBL
LigandPNGBDBM50151245(CHEMBL1229516)
Affinity DataIC50:  1.50E+4nM. Assay description: Inhibition of ADAM-10 in human L428 cells assessed as reduction in pervanadate-induced soluble ULBP3 shedding after 24 hrs by ELISA
In DepthDetails ArticlePubMed
TargetDisintegrin and metalloproteinase domain-containing protein 10(Homo sapiens (Human))
San Raffaele Scientific Institute
Curated by ChEMBL
LigandPNGBDBM50151245(CHEMBL1229516)
Affinity DataIC50:  1.20E+4nM. Assay description: Inhibition of ADAM-10 in human L428 cells assessed as reduction in pervanadate-induced soluble MICB shedding after 24 hrs by ELISA
In DepthDetails ArticlePubMed
TargetDisintegrin and metalloproteinase domain-containing protein 10(Homo sapiens (Human))
San Raffaele Scientific Institute
Curated by ChEMBL
LigandPNGBDBM50151245(CHEMBL1229516)
Affinity DataIC50:  5.00E+3nM. Assay description: Inhibition of ADAM-10 in human L428 cells assessed as reduction in pervanadate-induced TNFalpha shedding after 24 hrs by ELISA
In DepthDetails ArticlePubMed
TargetDisintegrin and metalloproteinase domain-containing protein 17(Homo sapiens (Human))
San Raffaele Scientific Institute
Curated by ChEMBL
LigandPNGBDBM50151245(CHEMBL1229516)
Affinity DataIC50:  1.00E+4nM. Assay description: Inhibition of ADAM-17 in human L428 cells assessed as reduction in pervanadate-induced soluble ALCAM shedding after 24 hrs by ELISA
In DepthDetails ArticlePubMed
TargetDisintegrin and metalloproteinase domain-containing protein 10(Homo sapiens (Human))
San Raffaele Scientific Institute
Curated by ChEMBL
LigandPNGBDBM50151245(CHEMBL1229516)
Affinity DataIC50:  1.00E+4nM. Assay description: Inhibition of ADAM-10 in human L540 cells assessed as reduction in pervanadate-induced soluble ULBP3 shedding after 24 hrs by ELISA
In DepthDetails ArticlePubMed
TargetDisintegrin and metalloproteinase domain-containing protein 10(Homo sapiens (Human))
San Raffaele Scientific Institute
Curated by ChEMBL
LigandPNGBDBM50151245(CHEMBL1229516)
Affinity DataIC50:  1.20E+4nM. Assay description: Inhibition of ADAM-10 in human L540 cells assessed as reduction in pervanadate-induced soluble MICB shedding after 24 hrs by ELISA
In DepthDetails ArticlePubMed
TargetDisintegrin and metalloproteinase domain-containing protein 10(Homo sapiens (Human))
San Raffaele Scientific Institute
Curated by ChEMBL
LigandPNGBDBM50151245(CHEMBL1229516)
Affinity DataIC50:  1.20E+4nM. Assay description: Inhibition of ADAM-10 in human KM-H2 cells assessed as reduction in pervanadate-induced soluble MICB shedding after 24 hrs by ELISA
In DepthDetails ArticlePubMed