BDBM50157833 CHEMBL182077::N-[3''-(3-Hydroxy-2,4-dioxo-3,4-dihydro-2H-thieno[3,2-d]pyrimidin-1-ylmethyl)-biphenyl-3-yl]-acetamide
SMILES CC(=O)Nc1cccc(c1)-c1cccc(Cn2c3ccsc3c(=O)n(O)c2=O)c1
InChI Key InChIKey=NZMGQXQQSAFNLL-UHFFFAOYSA-N
Data  2 IC50
  Tab Delimited (TSV)   2D SDfile   Computed 3D by Vconf -m prep SDfile
Find this compound or compounds like it in BindingDB:
Activity Spreadsheet -- Enzyme Inhibition Constant Data from BindingDB
Found 2 hits for monomerid = 50157833
TargetFlap endonuclease 1(Homo sapiens (Human))
Athersys
Curated by ChEMBL
LigandPNGBDBM50157833(CHEMBL182077 | N-[3''-(3-Hydroxy-2,4-dioxo-3,4-dih...)
Affinity DataIC50:  0.00400nM. Assay description: Inhibitory concentration against the Flap endonuclease-1
In DepthDetails ArticlePubMed
TargetDNA excision repair protein ERCC-5(Homo sapiens (Human))
Athersys
Curated by ChEMBL
LigandPNGBDBM50157833(CHEMBL182077 | N-[3''-(3-Hydroxy-2,4-dioxo-3,4-dih...)
Affinity DataIC50:  0.556nM. Assay description: Inhibitory concentration against the xeroderma pigmentosum G
In DepthDetails ArticlePubMed