BDBM50167479 3-Nitro-11-aza-tricyclo[7.3.1.0*2,7*]trideca-2,4,6-triene::CHEMBL365578
SMILES [O-][N+](=O)c1cccc2CC3CNCC(C3)c12
InChI Key InChIKey=QAOGJKYLKKJSNB-UHFFFAOYSA-N
Data  1 KI
  Tab Delimited (TSV)   2D SDfile   Computed 3D by Vconf -m prep SDfile
Find this compound or compounds like it in BindingDB:
Activity Spreadsheet -- Enzyme Inhibition Constant Data from BindingDB
Found 1 hit for monomerid = 50167479
TargetNeuronal acetylcholine receptor subunit alpha-4/beta-2(Homo sapiens (Human))
Pfizer
Curated by ChEMBL
LigandPNGBDBM50167479(3-Nitro-11-aza-tricyclo[7.3.1.0*2,7*]trideca-2,4,6...)
Affinity DataKi:  14nM. Assay description: Binding affinity against nicotinic acetylcholine receptor alpha4-beta2 in human HEK293 cells using [3H]- nicotine as radioligand
In DepthDetails ArticlePubMed