BDBM50172407 CHEMBL3810002
SMILES CCOc1cc(CNc2nc3c(N)ncnc3n2[C@@H]2O[C@H](CO)[C@@H](O)[C@H]2O)ccc1-c1ccccc1
InChI Key InChIKey=VZKDFUYTJCVISC-UMCMBGNQSA-N
Data  1 IC50
  Tab Delimited (TSV)   2D SDfile   Computed 3D by Vconf -m prep SDfile
Find this compound or compounds like it in BindingDB:
Activity Spreadsheet -- Enzyme Inhibition Constant Data from BindingDB
Found 1 hit for monomerid = 50172407
TargetSodium/nucleoside cotransporter 2(Homo sapiens (Human))
Kissei Pharmaceutical
Curated by ChEMBL
LigandPNGBDBM50172407(CHEMBL3810002)
Affinity DataIC50:  2.30E+3nM. Assay description: Inhibition of human CNT2 expressed in African green monkey COS7 cells assessed as reduction of [14C]-inosine uptake by liquid scintillation counting ...
In DepthDetails ArticlePubMed