BDBM50183237 3-(6-((1R,2R)-1-(1H-imidazol-1-yl)-2-(isopropyl(methyl)amino)propyl)naphthalen-2-yloxy)-2,2-dimethylpropanoic acid::CHEMBL207486
SMILES CC(C)N(C)[C@H](C)[C@@H](c1ccc2cc(OCC(C)(C)C(O)=O)ccc2c1)n1ccnc1
InChI Key InChIKey=GVLPJHAOLSTQRA-JPYJTQIMSA-N
Data  2 IC50
  Tab Delimited (TSV)   2D SDfile   Computed 3D by Vconf -m prep SDfile
Find this compound or compounds like it in BindingDB:
Activity Spreadsheet -- Enzyme Inhibition Constant Data from BindingDB
Found 2 hits for monomerid = 50183237
TargetCytochrome P450 26A1(Homo sapiens (Human))
Osi Pharmaceuticals
Curated by ChEMBL
LigandPNGBDBM50183237(3-(6-((1R,2R)-1-(1H-imidazol-1-yl)-2-(isopropyl(me...)
Affinity DataIC50:  3nM. Assay description: Inhibition of CYP26 expressed in human T47D cell line
In DepthDetails ArticlePubMed
TargetCytochrome P450 3A4(Homo sapiens (Human))
Osi Pharmaceuticals
Curated by ChEMBL
LigandPNGBDBM50183237(3-(6-((1R,2R)-1-(1H-imidazol-1-yl)-2-(isopropyl(me...)
Affinity DataIC50:  400nM. Assay description: Inhibition of CYP3A4
In DepthDetails ArticlePubMed