BDBM50222914 4'-[5-(4-cyclopropylaminomethyl-phenylamino)-2H-pyrazol-3-yl]-biphenyl-2,4-diol::CHEMBL241232
SMILES Oc1ccc(c(O)c1)-c1ccc(cc1)-c1cc(Nc2ccc(CNC3CC3)cc2)[nH]n1
InChI Key InChIKey=GRGYFHNWICGOLR-UHFFFAOYSA-N
Data  1 KI  1 EC50
  Tab Delimited (TSV)   2D SDfile   Computed 3D by Vconf -m prep SDfile
Find this compound or compounds like it in BindingDB:
Activity Spreadsheet -- Enzyme Inhibition Constant Data from BindingDB
Found 2 hits for monomerid = 50222914
TargetSerine/threonine-protein kinase Chk1(Homo sapiens (Human))
Pfizer
Curated by ChEMBL
LigandPNGBDBM50222914(4'-[5-(4-cyclopropylaminomethyl-phenylamino)-2H-py...)
Affinity DataKi:  0.380nM. Assay description: Inhibition of human CHK1 expressed in baculovirus/insect cell system
In DepthDetails ArticlePubMed
TargetSerine/threonine-protein kinase Chk1(Homo sapiens (Human))
Pfizer
Curated by ChEMBL
LigandPNGBDBM50222914(4'-[5-(4-cyclopropylaminomethyl-phenylamino)-2H-py...)
Affinity DataEC50:  60nM. Assay description: Activity at human CHK1 in CA46 cells by histone H3 ELISA assay
In DepthDetails ArticlePubMed