BDBM50230418 CHEMBL260629::N(gamma)-hydroxy-L-arginine::N-OMEGA-HYDROXY-L-ARGININE::Nomega-hydroxy-L-arginine
SMILES NC(NO)=NCCC[C@H]([NH3+])C([O-])=O
InChI Key InChIKey=FQWRAVYMZULPNK-BYPYZUCNSA-N
Data  2 KI  1 IC50  2 Kd
  Tab Delimited (TSV)   2D SDfile   Computed 3D by Vconf -m prep SDfile
Find this compound or compounds like it in BindingDB:
Activity Spreadsheet -- Enzyme Inhibition Constant Data from BindingDB
Found 5 hits for monomerid = 50230418
TargetArginase-2, mitochondrial(Homo sapiens (Human))
Oncoarendi Therapeutics
Curated by ChEMBL
LigandPNGBDBM50230418(CHEMBL260629 | N(gamma)-hydroxy-L-arginine | N-OME...)
Affinity DataKi:  1.60E+3nM. Assay description: Inhibition of human Arg2 at pH 7.5
In DepthDetails ArticlePubMed
TargetArginase-1(Bos taurus)
Christian-Albrechts-University Of Kiel
Curated by ChEMBL
LigandPNGBDBM50230418(CHEMBL260629 | N(gamma)-hydroxy-L-arginine | N-OME...)
Affinity DataKi:  3.00E+4nM. Assay description: Inhibition of bovine liver arginase
In DepthDetails ArticlePubMedMMDB
TargetArginase-1(Homo sapiens (Human))
Oncoarendi Therapeutics
Curated by ChEMBL
LigandPNGBDBM50230418(CHEMBL260629 | N(gamma)-hydroxy-L-arginine | N-OME...)
Affinity DataKd:  3.60E+3nM. Assay description: Binding affinity to human Arg1 at pH 8.5
In DepthDetails ArticlePubMedMMDB
TargetNitric oxide synthase, inducible(Homo sapiens (Human))
University Of Utrecht
Curated by ChEMBL
LigandPNGBDBM50230418(CHEMBL260629 | N(gamma)-hydroxy-L-arginine | N-OME...)
Affinity DataKd:  5.10E+3nM. Assay description: Binding affinity to iNOS with heme domain construct (unknown origin) assessed as spectral binding constant by spectral assay
In DepthDetails ArticlePubMedMMDB
TargetArginase-1(Rattus norvegicus)
Oncoarendi Therapeutics
Curated by ChEMBL
LigandPNGBDBM50230418(CHEMBL260629 | N(gamma)-hydroxy-L-arginine | N-OME...)
Affinity DataIC50:  2.00E+4nM. Assay description: Inhibition of rat Arg1 at pH 7.4
In DepthDetails ArticlePubMedMMDB