BDBM50233622 CHEMBL4073011::US10882838, Example 1.35
SMILES [H][C@@]12CC(C)=CC[C@@]1([H])C(C)(C)Oc1cc(cc(O)c21)C(C)(C)C(=O)OCC
InChI Key InChIKey=JSXWUVARLKOUGN-HZPDHXFCSA-N
Data  6 KI  1 EC50
  Tab Delimited (TSV)   2D SDfile   Computed 3D by Vconf -m prep SDfile
Find this compound or compounds like it in BindingDB:
Activity Spreadsheet -- Enzyme Inhibition Constant Data from BindingDB
Found 7 hits for monomerid = 50233622
TargetCannabinoid receptor 2(MOUSE)
Northeastern University
Curated by ChEMBL
LigandPNGBDBM50233622(CHEMBL4073011 | US10882838, Example 1.35)
Affinity DataKi:  0.5nM. Assay description: Displacement of [3H]CP-55,940 from mouse CB2 receptor expressed in HEK293 cells by scintillation counting method
In DepthDetails ArticlePubMed
TargetCannabinoid receptor 2(MOUSE)
Northeastern University
Curated by ChEMBL
LigandPNGBDBM50233622(CHEMBL4073011 | US10882838, Example 1.35)
Affinity DataKi:  0.5nM. Assay description: All the cannabinoids discussed in this invention are tested for their ability to bind to CB1 and CB2 receptors using membranes from rat brain or HEK2...
In DepthDetails US Patent
TargetCannabinoid receptor 2(Homo sapiens (Human))
Northeastern University
Curated by ChEMBL
LigandPNGBDBM50233622(CHEMBL4073011 | US10882838, Example 1.35)
Affinity DataKi:  1.5nM. Assay description: Displacement of [3H]CP-55,940 from human CB2 receptor expressed in HEK293 cells by scintillation counting method
In DepthDetails ArticlePubMed
TargetCannabinoid receptor 2(Homo sapiens (Human))
Northeastern University
Curated by ChEMBL
LigandPNGBDBM50233622(CHEMBL4073011 | US10882838, Example 1.35)
Affinity DataKi:  1.5nM. Assay description: All the cannabinoids discussed in this invention are tested for their ability to bind to CB1 and CB2 receptors using membranes from rat brain or HEK2...
In DepthDetails US Patent
TargetCannabinoid receptor 1(Rattus norvegicus (rat))
Northeastern University
Curated by ChEMBL
LigandPNGBDBM50233622(CHEMBL4073011 | US10882838, Example 1.35)
Affinity DataKi:  2.70nM. Assay description: Displacement of [3H]CP-55,940 from CB1 receptor in rat brain membranes by scintillation counting method
In DepthDetails ArticlePubMed
TargetCannabinoid receptor 1(Rattus norvegicus (rat))
Northeastern University
Curated by ChEMBL
LigandPNGBDBM50233622(CHEMBL4073011 | US10882838, Example 1.35)
Affinity DataKi:  2.70nM. Assay description: All the cannabinoids discussed in this invention are tested for their ability to bind to CB1 and CB2 receptors using membranes from rat brain or HEK2...
In DepthDetails US Patent
TargetCannabinoid receptor 1(Rattus norvegicus (rat))
Northeastern University
Curated by ChEMBL
LigandPNGBDBM50233622(CHEMBL4073011 | US10882838, Example 1.35)
Affinity DataEC50:  1nM. Assay description: Agonist activity at CB1 receptor in rat brain membranes assessed as reduction in forskolin-stimulated cAMP level measured from 3 data points after 30...
In DepthDetails ArticlePubMed