BDBM50239494 CHEMBL4079243::US10329302, Example 340::US10793579, Example 340::US11702424, Example 340
SMILES COC[C@@H]1CC(=O)N[C@@H]1COc1nccc2cc(C(N)=O)c(OC)cc12
InChI Key InChIKey=XVWKFNYNNZFHOB-SMDDNHRTSA-N
Data  5 IC50
  Tab Delimited (TSV)   2D SDfile   Computed 3D by Vconf -m prep SDfile
Find this compound or compounds like it in BindingDB:
Activity Spreadsheet -- Enzyme Inhibition Constant Data from BindingDB
Found 5 hits for monomerid = 50239494
TargetInterleukin-1 receptor-associated kinase 4(Homo sapiens (Human))
Pfizer
Curated by ChEMBL
LigandPNGBDBM50239494(CHEMBL4079243 | US10329302, Example 340 | US107935...)
Affinity DataIC50:  373nM. Assay description: Inhibition of IRAK4 in human PBMC assessed as reduction in R848-stimulated TNF alpha production after 3 hrs
In DepthDetails ArticlePubMed
TargetInterleukin-1 receptor-associated kinase 4(Homo sapiens (Human))
Pfizer
Curated by ChEMBL
LigandPNGBDBM50239494(CHEMBL4079243 | US10329302, Example 340 | US107935...)
Affinity DataIC50:  12nM. Assay description: Inhibition of N-terminal His6-tagged human full length IRAK4 preincubated for 20 mins followed by biotinylated-AGAGRDKYKTLRQIR substrate addition in ...
In DepthDetails ArticlePubMed
TargetInterleukin-1 receptor-associated kinase 4(Homo sapiens (Human))
Pfizer
Curated by ChEMBL
LigandPNGBDBM50239494(CHEMBL4079243 | US10329302, Example 340 | US107935...)
Affinity DataIC50:  12nM. Assay description: This is an in vitro assay to measure IRAK4 enzymatic activity utilizing the DELFIA (Dissociation-Enhanced Lanthanide Fluorescent Immunoassay, Perkin-...
In DepthDetails US Patent
TargetInterleukin-1 receptor-associated kinase 4(Homo sapiens (Human))
Pfizer
Curated by ChEMBL
LigandPNGBDBM50239494(CHEMBL4079243 | US10329302, Example 340 | US107935...)
Affinity DataIC50:  12nM. Assay description: Protocol B: To begin the assay, 45 μL of reaction mixture containing 20 mM HEPES pH=7.5, 5 mM MgCl2, 0.0025% Brij-35, 600 μM ATP, 228 μ...
In DepthDetails US Patent
TargetInterleukin-1 receptor-associated kinase 4(Homo sapiens (Human))
Pfizer
Curated by ChEMBL
LigandPNGBDBM50239494(CHEMBL4079243 | US10329302, Example 340 | US107935...)
Affinity DataIC50:  12nM. Assay description: This is an in vitro assay to measure IRAK4 enzymatic activity utilizing the DELFIA (Dissociation-Enhanced Lanthanide Fluorescent Immunoassay, Perkin-...
In DepthDetails US Patent