BDBM50242268 2,5-Imino-1,2,5-trideoxy-L-glucitol::CHEMBL502230
SMILES C[C@H]1N[C@@H](CO)[C@H](O)[C@H]1O
InChI Key InChIKey=YRBKDBZXOAEMOT-VANKVMQKSA-N
Data  1 KI  2 IC50
  Tab Delimited (TSV)   2D SDfile   Computed 3D by Vconf -m prep SDfile
Find this compound or compounds like it in BindingDB:
Activity Spreadsheet -- Enzyme Inhibition Constant Data from BindingDB
Found 3 hits for monomerid = 50242268
TargetTissue alpha-L-fucosidase(Bos taurus)
Hokuriku University
Curated by ChEMBL
LigandPNGBDBM50242268(2,5-Imino-1,2,5-trideoxy-L-glucitol | CHEMBL502230)
Affinity DataKi:  490nM. Assay description: Inhibition of bovine epididymis alpha-L-fucosidase assessed as p-nitrophenol release by spectrophotometrically
In DepthDetails ArticlePubMed
TargetTissue alpha-L-fucosidase(Bos taurus)
Hokuriku University
Curated by ChEMBL
LigandPNGBDBM50242268(2,5-Imino-1,2,5-trideoxy-L-glucitol | CHEMBL502230)
Affinity DataIC50:  1.00E+3nM. Assay description: Inhibition of bovine epididymis alpha-L-fucosidase assessed as p-nitrophenol release by spectrophotometrically
In DepthDetails ArticlePubMed
TargetBeta-galactosidase(Bos taurus (Bovine))
Hokuriku University
Curated by ChEMBL
LigandPNGBDBM50242268(2,5-Imino-1,2,5-trideoxy-L-glucitol | CHEMBL502230)
Affinity DataIC50:  4.20E+5nM. Assay description: Inhibition of bovine liver beta-galactosidase assessed as p-nitrophenol release by spectrophotometrically
In DepthDetails ArticlePubMed