BDBM50255907 6-(4-(5-fluoro-6-methylpyridin-2-yl)-2-(piperidin-1-yl)-1H-imidazol-5-yl)-[1,2,4]triazolo[1,5-a]pyridine::CHEMBL481546
SMILES Cc1nc(ccc1F)-c1nc([nH]c1-c1ccc2ncnn2c1)N1CCCCC1
InChI Key InChIKey=KSSUYMUKJSYAEK-UHFFFAOYSA-N
Data  1 KI
  Tab Delimited (TSV)   2D SDfile   Computed 3D by Vconf -m prep SDfile
Find this compound or compounds like it in BindingDB:
Activity Spreadsheet -- Enzyme Inhibition Constant Data from BindingDB
Found 1 hit for monomerid = 50255907
TargetTGF-beta receptor type-1(Homo sapiens (Human))
Abbott Laboratories
Curated by ChEMBL
LigandPNGBDBM50255907(6-(4-(5-fluoro-6-methylpyridin-2-yl)-2-(piperidin-...)
Affinity DataKi:  53.2nM. Assay description: Binding affinity to human TGFBR1
In DepthDetails ArticlePubMed