BDBM50304627 (2S,3S,4R,5R,6S)-6-methylpiperidine-2,3,4,5-tetraol::CHEMBL596048
SMILES C[C@@H]1N[C@@H](O)[C@@H](O)[C@H](O)[C@@H]1O
InChI Key InChIKey=XNAOURWCCAEPNE-KGJVWPDLSA-N
Data  1 KI
  Tab Delimited (TSV)   2D SDfile   Computed 3D by Vconf -m prep SDfile
Find this compound or compounds like it in BindingDB:
Activity Spreadsheet -- Enzyme Inhibition Constant Data from BindingDB
Found 1 hit for monomerid = 50304627
TargetTissue alpha-L-fucosidase(Bos taurus)
Universit£
Curated by ChEMBL
LigandPNGBDBM50304627((2S,3S,4R,5R,6S)-6-methylpiperidine-2,3,4,5-tetrao...)
Affinity DataKi:  1nM. Assay description: Inhibition of bovine kidney alpha-L-fucosidase by para-nitrophenolate release assay
In DepthDetails ArticlePubMed