BDBM50373981 CHEMBL403239
SMILES Nc1c(O)cccc1O
InChI Key InChIKey=JEPCLNGRAIMPQV-UHFFFAOYSA-N
Data  1 KI  2 IC50
  Tab Delimited (TSV)   2D SDfile   Computed 3D by Vconf -m prep SDfile
Find this compound or compounds like it in BindingDB:
Activity Spreadsheet -- Enzyme Inhibition Constant Data from BindingDB
Found 3 hits for monomerid = 50373981
TargetSucrase-isomaltase, intestinal(Rattus norvegicus (Rat))
Hokkaido University
Curated by ChEMBL
LigandPNGBDBM50373981(CHEMBL403239)
Affinity DataKi:  4.20E+3nM. Assay description: Inhibition of sucrose hydrolyzing activity of rat intestinal alpha glucosidase
In DepthDetails ArticlePubMed
TargetSucrase-isomaltase, intestinal(Rattus norvegicus (Rat))
Hokkaido University
Curated by ChEMBL
LigandPNGBDBM50373981(CHEMBL403239)
Affinity DataIC50:  8.5nM. Assay description: Inhibition of rat intestinal maltase
In DepthDetails ArticlePubMed
TargetSucrase-isomaltase, intestinal(Rattus norvegicus (Rat))
Hokkaido University
Curated by ChEMBL
LigandPNGBDBM50373981(CHEMBL403239)
Affinity DataIC50:  4.20E+3nM. Assay description: Inhibition of rat intestinal sucrase
In DepthDetails ArticlePubMed