BDBM50417569 CHEMBL1642150
SMILES NC(=O)c1c2CCCCc2sc1NC(=O)Cn1cc(CO)c(n1)C(F)(F)F
InChI Key InChIKey=ZGRBZBGNPZBNLW-UHFFFAOYSA-N
Data  1 EC50
PDB links: 1 PDB ID matches this monomer.
  Tab Delimited (TSV)   2D SDfile   Computed 3D by Vconf -m prep SDfile
Find this compound or compounds like it in BindingDB:
Activity Spreadsheet -- Enzyme Inhibition Constant Data from BindingDB
Found 1 hit for monomerid = 50417569
TargetGlutamate receptor 2(Homo sapiens (Human))
Merck Research Laboratories
Curated by ChEMBL
LigandPNGBDBM50417569(CHEMBL1642150)
Affinity DataEC50:  398nM. Assay description: Modulatory activity at GluA2 receptor LBD