BDBM504258 N-(2-((R)-2-Fluoro-3-hydroxy- 3-methylbutyl)-6-((7S,8aR)-7- methoxyhexahydropyrrolo[1,2- a]pyrazin-2(lH)-yl)-1- oxoisoindolin-5-yl)pyrazolo[1,5- a]pyrimidine-3-carboxamide::US11034698, Example 108
SMILES CO[C@H]1C[C@@H]2CN(CCN2C1)c1cc2C(=O)N(C[C@@H](F)C(C)(C)O)Cc2cc1NC(=O)c1cnn2cccnc12
InChI Key InChIKey=KJSVNYWOSOQKIN-YDIMBITNSA-N
Data  1 KI
  Tab Delimited (TSV)   2D SDfile   Computed 3D by Vconf -m prep SDfile
Find this compound or compounds like it in BindingDB:
Activity Spreadsheet -- Enzyme Inhibition Constant Data from BindingDB
Found 1 hit for monomerid = 504258
TargetNuclear receptor ROR-gamma(Homo sapiens (Human))
Genentech
US Patent
LigandPNGBDBM504258(N-(2-((R)-2-Fluoro-3-hydroxy- 3-methylbutyl)-6-((7...)
Affinity DataKi:  1.30nM. Assay description: The IRAK4 reaction conditions were optimized using an IRAK1-derived peptide (sequence H-KKARFSRFAGSSPSQSSMVAR) to provide a linear reaction rate over...
Ligand InfoPC cidPC sid
In DepthDetails US Patent