BDBM50438447 CHEMBL2414514
SMILES COC(=O)CS(=O)(=O)C[C@H]1O[C@H](C[C@@H]1S(=O)(=O)CC(=O)OC)n1cc(C)c(=O)[nH]c1=O
InChI Key InChIKey=CZCDNDMMPCTXKZ-GRYCIOLGSA-N
Data  1 KI
  Tab Delimited (TSV)   2D SDfile   Computed 3D by Vconf -m prep SDfile
Find this compound or compounds like it in BindingDB:
Activity Spreadsheet -- Enzyme Inhibition Constant Data from BindingDB
Found 1 hit for monomerid = 50438447
TargetRibonuclease pancreatic(Bison bison (American bison))
Institute Of Technology Kharagpur
Curated by ChEMBL
LigandPNGBDBM50438447(CHEMBL2414514)
Affinity DataKi:  2.67E+5nM. Assay description: Reversible competitive inhibition of bovine pancreatic RNase A using 2',3'-cCMP as substrate by Lineweaver-Burk plot analysis
In DepthDetails ArticlePubMed