BDBM50475526 CHEMBL198467
SMILES CCCCCCc1ccc(cc1)-c1ccc(cc1)C(O)=O
InChI Key InChIKey=ROJCBWVSXWIGAL-UHFFFAOYSA-N
Data  2 EC50
  Tab Delimited (TSV)   2D SDfile   Computed 3D by Vconf -m prep SDfile
Find this compound or compounds like it in BindingDB:
Activity Spreadsheet -- Enzyme Inhibition Constant Data from BindingDB
Found 2 hits for monomerid = 50475526
TargetRetinoic acid receptor beta(Homo sapiens (Human))
Acadia Pharmaceuticals
Curated by ChEMBL
LigandPNGBDBM50475526(CHEMBL198467)
Affinity DataEC50: >1.00E+4nM. Assay description: Transcriptional activity against RARbeta1
In DepthDetails ArticlePubMed
TargetRetinoic acid receptor beta(Homo sapiens (Human))
Acadia Pharmaceuticals
Curated by ChEMBL
LigandPNGBDBM50475526(CHEMBL198467)
Affinity DataEC50:  50nM. Assay description: Transcriptional activity against RARbeta2
In DepthDetails ArticlePubMed