BDBM50492879 CHEMBL2414070
SMILES NS(=O)(=O)c1ccc(s1)-c1cn(nn1)-c1cccc(c1)C#N
InChI Key InChIKey=SUOSUWXLPRQCMG-UHFFFAOYSA-N
Data  4 KI
PDB links: 1 PDB ID matches this monomer.
  Tab Delimited (TSV)   2D SDfile   Computed 3D by Vconf -m prep SDfile
Find this compound or compounds like it in BindingDB:
Activity Spreadsheet -- Enzyme Inhibition Constant Data from BindingDB
Found 4 hits for monomerid = 50492879
TargetCarbonic anhydrase 2(Homo sapiens (Human))
Latvian Association Of Human Genetics
Curated by ChEMBL
LigandPNGBDBM50492879(CHEMBL2414070)
Affinity DataKi:  4.5nM. Assay description: Inhibition of human carbonic anhydrase 2 preincubated for 15 mins by stopped flow CO2 hydration assay
Ligand InfoPC cidPC sidPDB
TargetCarbonic anhydrase 12(Homo sapiens (Human))
Latvian Association Of Human Genetics
Curated by ChEMBL
LigandPNGBDBM50492879(CHEMBL2414070)
Affinity DataKi:  6nM. Assay description: Inhibition of human carbonic anhydrase 12 preincubated for 15 mins by stopped flow CO2 hydration assay
Ligand InfoPC cidPC sidPDB
In DepthDetails ArticlePubMed
TargetCarbonic anhydrase 9(Homo sapiens (Human))
Latvian Association Of Human Genetics
Curated by ChEMBL
LigandPNGBDBM50492879(CHEMBL2414070)
Affinity DataKi:  29nM. Assay description: Inhibition of human carbonic anhydrase 9 preincubated for 15 mins by stopped flow CO2 hydration assay
Ligand InfoPC cidPC sidPDB
In DepthDetails ArticlePubMed
TargetCarbonic anhydrase 1(Homo sapiens (Human))
Latvian Association Of Human Genetics
Curated by ChEMBL
LigandPNGBDBM50492879(CHEMBL2414070)
Affinity DataKi:  289nM. Assay description: Inhibition of human carbonic anhydrase 1 preincubated for 15 mins by stopped flow CO2 hydration assay
Ligand InfoPC cidPC sidPDB
In DepthDetails ArticlePubMed