BDBM50500483 CHEMBL3747257
SMILES [#6]-[#16]-c1sc(-[#7]-[#6](=O)\[#6]=[#6](\[#6])-[#6])nc1-[#6]
InChI Key InChIKey=DJNORLXEIXLXQE-UHFFFAOYSA-N
Data  2 KI
  Tab Delimited (TSV)   2D SDfile   Computed 3D by Vconf -m prep SDfile
Find this compound or compounds like it in BindingDB:
Activity Spreadsheet -- Enzyme Inhibition Constant Data from BindingDB
Found 2 hits for monomerid = 50500483
TargetTransmembrane domain-containing protein TMIGD3(Homo sapiens (Human))
Stockholm University
Curated by ChEMBL
LigandPNGBDBM50500483(CHEMBL3747257)
Affinity DataKi:  2.19E+3nM. Assay description: Displacement of CA200645 from human adenosine A3 receptor expressed in CHO CRE-SPAP cells incubated for 1 hr by fluorescence analysis
Ligand InfoPC cidPC sid
In DepthDetails ArticlePubMed
TargetAdenosine receptor A1(Homo sapiens (Human))
Stockholm University
Curated by ChEMBL
LigandPNGBDBM50500483(CHEMBL3747257)
Affinity DataKi:  2.95E+4nM. Assay description: Displacement of CA200645 from human adenosine A1 receptor expressed in CHO cells incubated for 1 hr by fluorescence analysis
Ligand InfoPC cidPC sid
In DepthDetails ArticlePubMed