BDBM50507542 CHEMBL4447552
SMILES Clc1cccc(c1)-c1cn(Cc2ccc(cc2)-c2cccnc2)nn1
InChI Key InChIKey=DTIBDUZHSDASKY-UHFFFAOYSA-N
Data  2 IC50
  Tab Delimited (TSV)   2D SDfile   Computed 3D by Vconf -m prep SDfile
Find this compound or compounds like it in BindingDB:
Activity Spreadsheet -- Enzyme Inhibition Constant Data from BindingDB
Found 2 hits for monomerid = 50507542
TargetAngiopoietin-1 receptor(Homo sapiens (Human))
Xi'An Jiaotong University
Curated by ChEMBL
LigandPNGBDBM50507542(CHEMBL4447552)
Affinity DataIC50:  0.280nM. Assay description: Inhibition of TIE2 (unknown origin) after 4 hrs by ADP-Glo reagent based luminescent assay
Ligand InfoPC cidPC sid
In DepthDetails ArticlePubMed
TargetVascular endothelial growth factor receptor 2(Homo sapiens (Human))
Xi'An Jiaotong University
Curated by ChEMBL
LigandPNGBDBM50507542(CHEMBL4447552)
Affinity DataIC50:  669nM. Assay description: Inhibition of VEGFR2 (unknown origin) after 1 hr by ADP-Glo reagent based luminescent assay
Ligand InfoPC cidPC sid
In DepthDetails ArticlePubMed