BDBM50514508 CHEMBL4549449
SMILES CC(NC(=O)c1cc2c(nc3ccccn3c2=O)n(Cc2ccccc2)c1=N)c1ccccc1
InChI Key InChIKey=JQHLCUIHVLWGLE-UHFFFAOYSA-N
Data  6 KI
  Tab Delimited (TSV)   2D SDfile   Computed 3D by Vconf -m prep SDfile
Find this compound or compounds like it in BindingDB:
Activity Spreadsheet -- Enzyme Inhibition Constant Data from BindingDB
Found 6 hits for monomerid = 50514508
TargetChitotriosidase-1(Mus musculus)
Dalian University Of Technology
Curated by ChEMBL
LigandPNGBDBM50514508(CHEMBL4549449)
Affinity DataKi:  35nM. Assay description: Inhibition of mouse CHIT1 catalytic domain overexpressed in Pichia pastoris using 4MU-(GlcNAc)2 as substrate after 30 mins by fluorescence based micr...
In DepthDetails ArticlePubMed
TargetChitotriosidase-1(Homo sapiens (Human))
Dalian University Of Technology
Curated by ChEMBL
LigandPNGBDBM50514508(CHEMBL4549449)
Affinity DataKi:  49nM. Assay description: Inhibition of human CHIT1 catalytic domain overexpressed in Pichia pastoris using 4MU-(GlcNAc)2 as substrate after 30 mins by fluorescence based micr...
In DepthDetails ArticlePubMed
TargetChitinase(Ostrinia furnacalis)
Dalian University Of Technology
Curated by ChEMBL
LigandPNGBDBM50514508(CHEMBL4549449)
Affinity DataKi:  390nM. Assay description: Inhibition of Ostrinia furnacalis chitinase h catalytic domain overexpressed in Pichia pastoris using 4MU-(GlcNAc)2 as substrate after 30 mins by flu...
In DepthDetails ArticlePubMed
TargetChitinase B(Serratia marcescens)
Dalian University Of Technology
Curated by ChEMBL
LigandPNGBDBM50514508(CHEMBL4549449)
Affinity DataKi:  410nM. Assay description: Inhibition of Serratia marcescens chitinase b catalytic domain overexpressed in Escherichia coli BL21(DE3) cells using 4MU-(GlcNAc)2 as substrate aft...
In DepthDetails ArticlePubMed
TargetAcidic mammalian chitinase(Mus musculus)
Dalian University Of Technology
Curated by ChEMBL
LigandPNGBDBM50514508(CHEMBL4549449)
Affinity DataKi:  510nM. Assay description: Inhibition of mouse acidic mammalian chitinase catalytic domain overexpressed in Pichia pastoris using 4MU-(GlcNAc)2 as substrate after 30 mins by fl...
In DepthDetails ArticlePubMed
TargetAcidic mammalian chitinase(Homo sapiens (Human))
Dalian University Of Technology
Curated by ChEMBL
LigandPNGBDBM50514508(CHEMBL4549449)
Affinity DataKi:  3.96E+3nM. Assay description: Inhibition of human acidic mammalian chitinase catalytic domain overexpressed in Pichia pastoris using 4MU-(GlcNAc)2 as substrate after 30 mins by fl...
In DepthDetails ArticlePubMed