BDBM50526311 CHEMBL4588745
SMILES CCOc1c(Cl)cc(cc1Cl)-c1nc(no1)-c1ccc(cc1)C(O)=O
InChI Key InChIKey=GHXGJOLUNUZQMR-UHFFFAOYSA-N
Data  3 EC50
  Tab Delimited (TSV)   2D SDfile   Computed 3D by Vconf -m prep SDfile
Find this compound or compounds like it in BindingDB:
Activity Spreadsheet -- Enzyme Inhibition Constant Data from BindingDB
Found 3 hits for monomerid = 50526311
TargetRetinoic acid receptor beta(Mus musculus)
King'S College
Curated by ChEMBL
LigandPNGBDBM50526311(CHEMBL4588745)
Affinity DataEC50:  1.5nM. Assay description: Transactivation of GAL4-fused mouse RARbeta-LBD expressed in COS-7 cells after 24 hrs by bright-Glo reagent based assay
Ligand InfoPC cidPC sid
In DepthDetails ArticlePubMed
TargetRetinoic acid receptor gamma(Mus musculus)
King'S College
Curated by ChEMBL
LigandPNGBDBM50526311(CHEMBL4588745)
Affinity DataEC50:  12nM. Assay description: Transactivation of GAL4-fused mouse RARgamma-LBD expressed in COS-7 cells after 24 hrs by bright-Glo reagent based assay
Ligand InfoPC cidPC sid
In DepthDetails ArticlePubMed
TargetRetinoic acid receptor alpha(Mus musculus)
King'S College
Curated by ChEMBL
LigandPNGBDBM50526311(CHEMBL4588745)
Affinity DataEC50:  18nM. Assay description: Transactivation of GAL4-fused mouse RARalpha-LBD expressed in COS-7 cells after 24 hrs by bright-Glo reagent based assay
Ligand InfoPC cidPC sid
In DepthDetails ArticlePubMed