BDBM50526316 CHEMBL4531897
SMILES Cc1ccc(C)c2oc(cc12)-c1nc(no1)-c1ccc(cc1F)C(O)=O
InChI Key InChIKey=VKVWPZOCWTYVPA-UHFFFAOYSA-N
Data  3 EC50
  Tab Delimited (TSV)   2D SDfile   Computed 3D by Vconf -m prep SDfile
Find this compound or compounds like it in BindingDB:
Activity Spreadsheet -- Enzyme Inhibition Constant Data from BindingDB
Found 3 hits for monomerid = 50526316
TargetRetinoic acid receptor alpha(Mus musculus)
King'S College
Curated by ChEMBL
LigandPNGBDBM50526316(CHEMBL4531897)
Affinity DataEC50:  61nM. Assay description: Transactivation of GAL4-fused mouse RARalpha-LBD expressed in COS-7 cells after 24 hrs by bright-Glo reagent based assay
Ligand InfoPC cidPC sid
In DepthDetails ArticlePubMed
TargetRetinoic acid receptor gamma(Mus musculus)
King'S College
Curated by ChEMBL
LigandPNGBDBM50526316(CHEMBL4531897)
Affinity DataEC50:  5.5nM. Assay description: Transactivation of GAL4-fused mouse RARgamma-LBD expressed in COS-7 cells after 24 hrs by bright-Glo reagent based assay
Ligand InfoPC cidPC sid
In DepthDetails ArticlePubMed
TargetRetinoic acid receptor beta(Mus musculus)
King'S College
Curated by ChEMBL
LigandPNGBDBM50526316(CHEMBL4531897)
Affinity DataEC50:  11nM. Assay description: Transactivation of GAL4-fused mouse RARbeta-LBD expressed in COS-7 cells after 24 hrs by bright-Glo reagent based assay
Ligand InfoPC cidPC sid
In DepthDetails ArticlePubMed