BDBM50530349 CHEMBL88917
SMILES Cc1cccc(Nc2ccnc(SCC(O)=O)n2)c1C
InChI Key InChIKey=BFQXQPITYSYKRZ-UHFFFAOYSA-N
Data  4 EC50
  Tab Delimited (TSV)   2D SDfile   Computed 3D by Vconf -m prep SDfile
Find this compound or compounds like it in BindingDB:
Activity Spreadsheet -- Enzyme Inhibition Constant Data from BindingDB
Found 4 hits for monomerid = 50530349
TargetPeroxisome proliferator-activated receptor gamma(Homo sapiens (Human))
Goethe University Frankfurt
Curated by ChEMBL
LigandPNGBDBM50530349(CHEMBL88917)
Affinity DataEC50:  3.60E+4nM. Assay description: Activation of human Gal4-fused PPARgamma LBD transfected in HEK293T after 14 to 16 hrs by dual-glo luciferase reporter gene assay
Ligand InfoPC cidPC sid
In DepthDetails ArticlePubMed
TargetPeroxisome proliferator-activated receptor alpha(Homo sapiens (Human))
Goethe University Frankfurt
Curated by ChEMBL
LigandPNGBDBM50530349(CHEMBL88917)
Affinity DataEC50:  1.40E+4nM. Assay description: Activation of human Gal4-fused PPARalpha LBD transfected in HEK293T after 14 to 16 hrs by dual-glo luciferase reporter gene assay
Ligand InfoPC cidPC sid
In DepthDetails ArticlePubMed
TargetPeroxisome proliferator-activated receptor gamma(Homo sapiens (Human))
Goethe University Frankfurt
Curated by ChEMBL
LigandPNGBDBM50530349(CHEMBL88917)
Affinity DataEC50:  3.60E+4nM. Assay description: Activation of human Gal4-fused PPARgamma LBD transfected in HEK293T after 14 to 16 hrs by dual-glo luciferase reporter gene assay
Ligand InfoPC cidPC sid
In DepthDetails ArticlePubMed
TargetPeroxisome proliferator-activated receptor alpha(Homo sapiens (Human))
Goethe University Frankfurt
Curated by ChEMBL
LigandPNGBDBM50530349(CHEMBL88917)
Affinity DataEC50:  1.40E+4nM. Assay description: Activation of human Gal4-fused PPARalpha LBD transfected in HEK293T after 14 to 16 hrs by dual-glo luciferase reporter gene assay
Ligand InfoPC cidPC sid
In DepthDetails ArticlePubMed