BDBM50530351 CHEMBL4443400
SMILES Cc1c(Cl)ccc(Nc2cc(Cl)nc(SCC(O)=O)n2)c1C
InChI Key InChIKey=HAJMGMXAZZMTQV-UHFFFAOYSA-N
Data  12 EC50
  Tab Delimited (TSV)   2D SDfile   Computed 3D by Vconf -m prep SDfile
Find this compound or compounds like it in BindingDB:
Activity Spreadsheet -- Enzyme Inhibition Constant Data from BindingDB
Found 12 hits for monomerid = 50530351
TargetRetinoic acid receptor RXR-beta(Homo sapiens (Human))
Goethe University Frankfurt
Curated by ChEMBL
LigandPNGBDBM50530351(CHEMBL4443400)
Affinity DataEC50:  7.80E+3nM. Assay description: Activation of human Gal4-fused RXRbeta LBD transfected in HEK293T after 14 to 16 hrs by dual-glo luciferase reporter gene assay
Ligand InfoPC cidPC sid
In DepthDetails ArticlePubMed
TargetPeroxisome proliferator-activated receptor alpha(Homo sapiens (Human))
Goethe University Frankfurt
Curated by ChEMBL
LigandPNGBDBM50530351(CHEMBL4443400)
Affinity DataEC50:  1.40E+4nM. Assay description: Activation of human Gal4-fused PPARalpha LBD transfected in HEK293T after 14 to 16 hrs by dual-glo luciferase reporter gene assay
Ligand InfoPC cidPC sid
In DepthDetails ArticlePubMed
TargetRetinoic acid receptor RXR-alpha(Homo sapiens (Human))
Goethe University Frankfurt
Curated by ChEMBL
LigandPNGBDBM50530351(CHEMBL4443400)
Affinity DataEC50:  6.10E+3nM. Assay description: Activation of human Gal4-fused RXRalpha LBD transfected in HEK293T after 14 to 16 hrs by dual-glo luciferase reporter gene assay
Ligand InfoPC cidPC sid
In DepthDetails ArticlePubMed
TargetPeroxisome proliferator-activated receptor gamma(Homo sapiens (Human))
Goethe University Frankfurt
Curated by ChEMBL
LigandPNGBDBM50530351(CHEMBL4443400)
Affinity DataEC50:  4.90E+4nM. Assay description: Activation of human Gal4-fused PPARgamma LBD transfected in HEK293T after 14 to 16 hrs by dual-glo luciferase reporter gene assay
Ligand InfoPC cidPC sid
In DepthDetails ArticlePubMed
TargetRetinoic acid receptor RXR-beta(Homo sapiens (Human))
Goethe University Frankfurt
Curated by ChEMBL
LigandPNGBDBM50530351(CHEMBL4443400)
Affinity DataEC50:  7.80E+3nM. Assay description: Activation of human Gal4-fused RXRbeta LBD transfected in HEK293T after 14 to 16 hrs by dual-glo luciferase reporter gene assay
Ligand InfoPC cidPC sid
In DepthDetails ArticlePubMed
TargetRetinoic acid receptor RXR-alpha(Homo sapiens (Human))
Goethe University Frankfurt
Curated by ChEMBL
LigandPNGBDBM50530351(CHEMBL4443400)
Affinity DataEC50:  6.10E+3nM. Assay description: Activation of human Gal4-fused RXRalpha LBD transfected in HEK293T after 14 to 16 hrs by dual-glo luciferase reporter gene assay
Ligand InfoPC cidPC sid
In DepthDetails ArticlePubMed
TargetPeroxisome proliferator-activated receptor delta(Homo sapiens (Human))
Goethe University Frankfurt
Curated by ChEMBL
LigandPNGBDBM50530351(CHEMBL4443400)
Affinity DataEC50: >3.00E+4nM. Assay description: Activation of human Gal4-fused PPARdelta LBD transfected in HEK293T after 14 to 16 hrs by dual-glo luciferase reporter gene assay
Ligand InfoPC cidPC sid
In DepthDetails ArticlePubMed
TargetRetinoic acid receptor RXR-gamma(Homo sapiens (Human))
Goethe University Frankfurt
Curated by ChEMBL
LigandPNGBDBM50530351(CHEMBL4443400)
Affinity DataEC50:  2.30E+4nM. Assay description: Activation of human Gal4-fused RXRgamma LBD transfected in HEK293T after 14 to 16 hrs by dual-glo luciferase reporter gene assay
Ligand InfoPC cidPC sid
In DepthDetails ArticlePubMed
TargetPeroxisome proliferator-activated receptor alpha(Homo sapiens (Human))
Goethe University Frankfurt
Curated by ChEMBL
LigandPNGBDBM50530351(CHEMBL4443400)
Affinity DataEC50:  1.40E+4nM. Assay description: Activation of human Gal4-fused PPARalpha LBD transfected in HEK293T after 14 to 16 hrs by dual-glo luciferase reporter gene assay
Ligand InfoPC cidPC sid
In DepthDetails ArticlePubMed
TargetRetinoic acid receptor RXR-gamma(Homo sapiens (Human))
Goethe University Frankfurt
Curated by ChEMBL
LigandPNGBDBM50530351(CHEMBL4443400)
Affinity DataEC50:  2.30E+4nM. Assay description: Activation of human Gal4-fused RXRgamma LBD transfected in HEK293T after 14 to 16 hrs by dual-glo luciferase reporter gene assay
Ligand InfoPC cidPC sid
In DepthDetails ArticlePubMed
TargetPeroxisome proliferator-activated receptor delta(Homo sapiens (Human))
Goethe University Frankfurt
Curated by ChEMBL
LigandPNGBDBM50530351(CHEMBL4443400)
Affinity DataEC50: >3.00E+4nM. Assay description: Activation of human Gal4-fused PPARdelta LBD transfected in HEK293T after 14 to 16 hrs by dual-glo luciferase reporter gene assay
Ligand InfoPC cidPC sid
In DepthDetails ArticlePubMed
TargetPeroxisome proliferator-activated receptor gamma(Homo sapiens (Human))
Goethe University Frankfurt
Curated by ChEMBL
LigandPNGBDBM50530351(CHEMBL4443400)
Affinity DataEC50:  4.90E+4nM. Assay description: Activation of human Gal4-fused PPARgamma LBD transfected in HEK293T after 14 to 16 hrs by dual-glo luciferase reporter gene assay
Ligand InfoPC cidPC sid
In DepthDetails ArticlePubMed