BDBM50532780 CHEMBL4475022::US10882838, Example 2.2
SMILES [H][C@@]12CC(CO)=CC[C@@]1([H])C(C)(C)Oc1cc(cc(O)c21)C(C)(C)C(=O)OCCCC
InChI Key InChIKey=AUMCYBWLZBTQLN-QZTJIDSGSA-N
Data  9 KI  4 EC50
  Tab Delimited (TSV)   2D SDfile   Computed 3D by Vconf -m prep SDfile
Find this compound or compounds like it in BindingDB:
Activity Spreadsheet -- Enzyme Inhibition Constant Data from BindingDB
Found 13 hits for monomerid = 50532780
TargetCannabinoid receptor 1(Rattus norvegicus (rat))
Northeastern University
Curated by ChEMBL
LigandPNGBDBM50532780(CHEMBL4475022 | US10882838, Example 2.2)
Affinity DataKi:  0.600nM. Assay description: Displacement of [3H]CP55940 from CB1 receptor in rat brain membranes by scintillation counting method
Ligand InfoPC cidPC sid
In DepthDetails ArticlePubMed
TargetCannabinoid receptor 1(Rattus norvegicus (rat))
Northeastern University
Curated by ChEMBL
LigandPNGBDBM50532780(CHEMBL4475022 | US10882838, Example 2.2)
Affinity DataKi:  0.600nM. Assay description: Displacement of [3H]CP55940 from CB1 receptor in rat brain membranes by scintillation counting method
Ligand InfoPC cidPC sid
In DepthDetails ArticlePubMed
TargetCannabinoid receptor 1(Rattus norvegicus (rat))
Northeastern University
Curated by ChEMBL
LigandPNGBDBM50532780(CHEMBL4475022 | US10882838, Example 2.2)
Affinity DataKi:  0.600nM. Assay description: All the cannabinoids discussed in this invention are tested for their ability to bind to CB1 and CB2 receptors using membranes from rat brain or HEK2...
Ligand InfoPC cidPC sid
In DepthDetails US Patent
TargetCannabinoid receptor 2(Homo sapiens (Human))
Northeastern University
Curated by ChEMBL
LigandPNGBDBM50532780(CHEMBL4475022 | US10882838, Example 2.2)
Affinity DataKi:  0.800nM. Assay description: Displacement of [3H]CP55940 from human CB2 receptor expressed in HEK293 cell membranes by scintillation counting method
Ligand InfoPC cidPC sid
In DepthDetails ArticlePubMed
TargetCannabinoid receptor 2(Homo sapiens (Human))
Northeastern University
Curated by ChEMBL
LigandPNGBDBM50532780(CHEMBL4475022 | US10882838, Example 2.2)
Affinity DataKi:  0.800nM. Assay description: Displacement of [3H]CP55940 from human CB2 receptor expressed in HEK293 cell membranes by scintillation counting method
Ligand InfoPC cidPC sid
In DepthDetails ArticlePubMed
TargetCannabinoid receptor 2(Homo sapiens (Human))
Northeastern University
Curated by ChEMBL
LigandPNGBDBM50532780(CHEMBL4475022 | US10882838, Example 2.2)
Affinity DataKi:  0.800nM. Assay description: All the cannabinoids discussed in this invention are tested for their ability to bind to CB1 and CB2 receptors using membranes from rat brain or HEK2...
Ligand InfoPC cidPC sid
In DepthDetails US Patent
TargetCannabinoid receptor 2(MOUSE)
Northeastern University
US Patent
LigandPNGBDBM50532780(CHEMBL4475022 | US10882838, Example 2.2)
Affinity DataKi:  1.5nM. Assay description: All the cannabinoids discussed in this invention are tested for their ability to bind to CB1 and CB2 receptors using membranes from rat brain or HEK2...
Ligand InfoPC cidPC sid
In DepthDetails US Patent
TargetCannabinoid receptor 2(MOUSE)
Northeastern University
US Patent
LigandPNGBDBM50532780(CHEMBL4475022 | US10882838, Example 2.2)
Affinity DataKi:  1.5nM. Assay description: Displacement of [3H]CP55940 from mouse CB2 receptor expressed in HEK293 cell membranes by scintillation counting method
Ligand InfoPC cidPC sid
In DepthDetails ArticlePubMed
TargetCannabinoid receptor 2(MOUSE)
Northeastern University
US Patent
LigandPNGBDBM50532780(CHEMBL4475022 | US10882838, Example 2.2)
Affinity DataKi:  1.5nM. Assay description: Displacement of [3H]CP55940 from mouse CB2 receptor expressed in HEK293 cell membranes by scintillation counting method
Ligand InfoPC cidPC sid
In DepthDetails ArticlePubMed
TargetCannabinoid receptor 1(Rattus norvegicus (rat))
Northeastern University
Curated by ChEMBL
LigandPNGBDBM50532780(CHEMBL4475022 | US10882838, Example 2.2)
Affinity DataEC50:  4.60nM. Assay description: Agonist activity at rat CB1 receptor expressed in HEK293 cells assessed as decrease in forskolin-stimulated cAMP levels after 30 mins
Ligand InfoPC cidPC sid
In DepthDetails ArticlePubMed
TargetCannabinoid receptor 1(Rattus norvegicus (rat))
Northeastern University
Curated by ChEMBL
LigandPNGBDBM50532780(CHEMBL4475022 | US10882838, Example 2.2)
Affinity DataEC50:  4.60nM. Assay description: Agonist activity at rat CB1 receptor expressed in HEK293 cells assessed as decrease in forskolin-stimulated cAMP levels after 30 mins
Ligand InfoPC cidPC sid
In DepthDetails ArticlePubMed
TargetCannabinoid receptor 2(Homo sapiens (Human))
Northeastern University
Curated by ChEMBL
LigandPNGBDBM50532780(CHEMBL4475022 | US10882838, Example 2.2)
Affinity DataEC50:  5.70nM. Assay description: Agonist activity at human CB2 receptor expressed in HEK293 cells assessed as decrease in forskolin-stimulated cAMP levels after 30 mins
Ligand InfoPC cidPC sid
In DepthDetails ArticlePubMed
TargetCannabinoid receptor 2(Homo sapiens (Human))
Northeastern University
Curated by ChEMBL
LigandPNGBDBM50532780(CHEMBL4475022 | US10882838, Example 2.2)
Affinity DataEC50:  5.70nM. Assay description: Agonist activity at human CB2 receptor expressed in HEK293 cells assessed as decrease in forskolin-stimulated cAMP levels after 30 mins
Ligand InfoPC cidPC sid
In DepthDetails ArticlePubMed