BDBM50533806 CHEMBL4476114
SMILES Cc1cc2c(cc1C(=C)c1ccc(cc1)S(O)(=O)=O)C(C)(C)CCC2(C)C
InChI Key InChIKey=OMEILGWMMVWOFI-UHFFFAOYSA-N
Data  1 EC50
  Tab Delimited (TSV)   2D SDfile   Computed 3D by Vconf -m prep SDfile
Find this compound or compounds like it in BindingDB:
Activity Spreadsheet -- Enzyme Inhibition Constant Data from BindingDB
Found 1 hit for monomerid = 50533806
TargetRetinoic acid receptor RXR-alpha/RXR-beta/RXR-gamma(Homo sapiens (Human))
Arizona State University
Curated by ChEMBL
LigandPNGBDBM50533806(CHEMBL4476114)
Affinity DataEC50:  1.82E+4nM. Assay description: Agonist activity at human RXR binding domain and activation domain expressed in human HCT116 cells assessed as rexinoid activity incubated for 24 hrs...
Ligand InfoPC cidPC sid
In DepthDetails ArticlePubMed