BDBM50536217 CHEMBL4517645
SMILES CCc1cc(O)c(F)cc1-c1cc(NS(=O)(=O)C(C)C)c2cn[nH]c2c1
InChI Key InChIKey=UUTJTJNTPAWMTO-UHFFFAOYSA-N
Data  4 IC50
  Tab Delimited (TSV)   2D SDfile   Computed 3D by Vconf -m prep SDfile
Find this compound or compounds like it in BindingDB:
Activity Spreadsheet -- Enzyme Inhibition Constant Data from BindingDB
Found 4 hits for monomerid = 50536217
TargetTyrosine-protein kinase JAK3(Homo sapiens (Human))
Leo Pharma
Curated by ChEMBL
LigandPNGBDBM50536217(CHEMBL4517645)
Affinity DataIC50:  2.5nM. Assay description: Inhibition of human His-tagged JAK3 expressed in baculovirus using biotin-synthetic peptide as substrate after 20 mins by HTRF assay
Ligand InfoPC cidPC sid
In DepthDetails ArticlePubMed
LigandPNGBDBM50536217(CHEMBL4517645)
Affinity DataIC50:  162nM. Assay description: Inhibition of JAK in human B lymphocyte cells assessed as suppression of IL4-induced STAT6 phosphorylation preincubated for 1 hr followed by IL4 addi...
Ligand InfoPC cidPC sid
In DepthDetails ArticlePubMed
TargetTyrosine-protein kinase JAK1(Homo sapiens (Human))
Leo Pharma
Curated by ChEMBL
LigandPNGBDBM50536217(CHEMBL4517645)
Affinity DataIC50:  6.90nM. Assay description: Inhibition of human Gst-tagged JAK1 (850 to 1154 residues) expressed in baculovirus using biotin-synthetic peptide as substrate after 40 mins by HTRF...
Ligand InfoPC cidPC sid
In DepthDetails ArticlePubMed
TargetTyrosine-protein kinase JAK2(Homo sapiens (Human))
Leo Pharma
Curated by ChEMBL
LigandPNGBDBM50536217(CHEMBL4517645)
Affinity DataIC50:  7.90nM. Assay description: Inhibition of human His-tagged JAK2 expressed in baculovirus using biotin-synthetic peptide as substrate after 20 mins by HTRF assay
Ligand InfoPC cidPC sid
In DepthDetails ArticlePubMed