BDBM50538736 CHEMBL4640580
SMILES Oc1c(Br)cc(cc1Br)C(=O)N1CCOc2ccncc12
InChI Key InChIKey=ZMVGQIIOXCGAFV-UHFFFAOYSA-N
Data  3 KI
  Tab Delimited (TSV)   2D SDfile   Computed 3D by Vconf -m prep SDfile
Find this compound or compounds like it in BindingDB:
Activity Spreadsheet -- Enzyme Inhibition Constant Data from BindingDB
Found 3 hits for monomerid = 50538736
TargetSolute carrier family 22 member 12(Homo sapiens (Human))
West China Hospital Of Sichuan University
Curated by ChEMBL
LigandPNGBDBM50538736(CHEMBL4640580)
Affinity DataKi:  57nM. Assay description: Inhibition of human URAT1
In DepthDetails ArticlePubMed
TargetSolute carrier family 22 member 8(Homo sapiens (Human))
West China Hospital Of Sichuan University
Curated by ChEMBL
LigandPNGBDBM50538736(CHEMBL4640580)
Affinity DataKi:  2.40E+3nM. Assay description: Inhibition of human OAT3
In DepthDetails ArticlePubMed
TargetSolute carrier family 22 member 6(Homo sapiens (Human))
West China Hospital Of Sichuan University
Curated by ChEMBL
LigandPNGBDBM50538736(CHEMBL4640580)
Affinity DataKi:  7.20E+3nM. Assay description: Inhibition of human OAT1
In DepthDetails ArticlePubMed