BDBM50545946 CHEMBL4760562
SMILES FC(F)Oc1ccc(Cl)cc1-c1n[nH]cc1NC(=O)c1cncc2c[nH]nc12
InChI Key InChIKey=JIRRPWVFUBYRKX-UHFFFAOYSA-N
Data  2 KI  3 IC50
  Tab Delimited (TSV)   2D SDfile   Computed 3D by Vconf -m prep SDfile
Find this compound or compounds like it in BindingDB:
Activity Spreadsheet -- Enzyme Inhibition Constant Data from BindingDB
Found 5 hits for monomerid = 50545946
TargetTyrosine-protein kinase JAK2(Homo sapiens (Human))
Genentech
Curated by ChEMBL
LigandPNGBDBM50545946(CHEMBL4760562)
Affinity DataKi:  0.490nM. Assay description: Inhibition of recombinant human JAK2 (812 to 1132 residues) expressed in insect cells using Y1-B as substrate incubated for 30 mins by microfluidic m...
Ligand InfoPC cidPC sid
In DepthDetails ArticlePubMed
TargetTyrosine-protein kinase JAK1(Homo sapiens (Human))
Genentech
Curated by ChEMBL
LigandPNGBDBM50545946(CHEMBL4760562)
Affinity DataKi:  0.560nM. Assay description: Inhibition of recombinant human JAK1 (854 to 1154 residues) expressed in insect cells using Y1-B as substrate incubated for 30 mins by microfluidic m...
Ligand InfoPC cidPC sid
In DepthDetails ArticlePubMed
TargetLeucine-rich repeat serine/threonine-protein kinase 2(Homo sapiens (Human))
Genentech
Curated by ChEMBL
LigandPNGBDBM50545946(CHEMBL4760562)
Affinity DataIC50:  79nM. Assay description: Inhibition of recombinant human GST-tagged LRRK2 (970 to 2527 residues) expressed in baculovirus expression system using LRRKtide as substrate incuba...
Ligand InfoPC cidPC sid
In DepthDetails ArticlePubMed
TargetTyrosine-protein kinase JAK1(Homo sapiens (Human))
Genentech
Curated by ChEMBL
LigandPNGBDBM50545946(CHEMBL4760562)
Affinity DataIC50:  1.90nM. Assay description: Inhibition of His-tagged BRPF1 (626 to 740 residues) (unknown origin) preincubated for 15 mins followed by addition of C-terminal biotinylated synthe...
Ligand InfoPC cidPC sid
In DepthDetails ArticlePubMed
LigandPNGBDBM50545946(CHEMBL4760562)
Affinity DataIC50:  18nM. Assay description: Inhibition of JAK in human BEAS-2B cells assessed as reduction in IL13-induced STAT6 phosphorylation incubated for 1 hr followed by IL13 addition and...
Ligand InfoPC cidPC sid
In DepthDetails ArticlePubMed