BDBM50545957 CHEMBL4750979
SMILES CSc1ccc(Cl)cc1-c1nn(C)cc1NC(=O)c1cnn2cccnc12
InChI Key InChIKey=RPYDIKFJMOQCQC-UHFFFAOYSA-N
Data  2 KI  1 IC50
  Tab Delimited (TSV)   2D SDfile   Computed 3D by Vconf -m prep SDfile
Find this compound or compounds like it in BindingDB:
Activity Spreadsheet -- Enzyme Inhibition Constant Data from BindingDB
Found 3 hits for monomerid = 50545957
TargetTyrosine-protein kinase JAK2(Homo sapiens (Human))
Genentech
Curated by ChEMBL
LigandPNGBDBM50545957(CHEMBL4750979)
Affinity DataKi:  0.230nM. Assay description: Inhibition of recombinant human JAK2 (812 to 1132 residues) expressed in insect cells using Y1-B as substrate incubated for 30 mins by microfluidic m...
Ligand InfoPC cidPC sid
In DepthDetails ArticlePubMed
TargetTyrosine-protein kinase JAK1(Homo sapiens (Human))
Genentech
Curated by ChEMBL
LigandPNGBDBM50545957(CHEMBL4750979)
Affinity DataKi:  0.460nM. Assay description: Inhibition of recombinant human JAK1 (854 to 1154 residues) expressed in insect cells using Y1-B as substrate incubated for 30 mins by microfluidic m...
Ligand InfoPC cidPC sid
In DepthDetails ArticlePubMed
LigandPNGBDBM50545957(CHEMBL4750979)
Affinity DataIC50:  11nM. Assay description: Inhibition of JAK in human BEAS-2B cells assessed as reduction in IL13-induced STAT6 phosphorylation incubated for 1 hr followed by IL13 addition and...
Ligand InfoPC cidPC sid
In DepthDetails ArticlePubMed