BDBM50545973 CHEMBL4781423::US11649241, Example 1
SMILES COc1ccc(Cl)cc1-c1nn(C)cc1NC(=O)c1cncc2cn(C)nc12
InChI Key InChIKey=FCWWZBZYMGWKGY-UHFFFAOYSA-N
Data  4 KI  1 IC50
PDB links: 1 PDB ID matches this monomer.
  Tab Delimited (TSV)   2D SDfile   Computed 3D by Vconf -m prep SDfile
Find this compound or compounds like it in BindingDB:
Activity Spreadsheet -- Enzyme Inhibition Constant Data from BindingDB
Found 5 hits for monomerid = 50545973
TargetTyrosine-protein kinase JAK1(Homo sapiens (Human))
Genentech
US Patent
LigandPNGBDBM50545973(CHEMBL4781423 | US11649241, Example 1)
Affinity DataKi:  3.63nM. Assay description: The activity of the isolated recombinant JAK1 and JAK2 kinase domain was measured by monitoring phosphorylation of a peptide derived from JAK3 (Val-A...
Ligand InfoPC cidPC sidPDB
TargetTyrosine-protein kinase JAK2(Homo sapiens (Human))
Genentech
US Patent
LigandPNGBDBM50545973(CHEMBL4781423 | US11649241, Example 1)
Affinity DataKi:  3.66nM. Assay description: The activity of the isolated recombinant JAK1 and JAK2 kinase domain was measured by monitoring phosphorylation of a peptide derived from JAK3 (Val-A...
Ligand InfoPC cidPC sidPDB
In DepthDetails US Patent
TargetTyrosine-protein kinase JAK1(Homo sapiens (Human))
Genentech
US Patent
LigandPNGBDBM50545973(CHEMBL4781423 | US11649241, Example 1)
Affinity DataKi:  4.30nM. Assay description: Inhibition of recombinant human JAK1 (854 to 1154 residues) expressed in insect cells using Y1-B as substrate incubated for 30 mins by microfluidic m...
Ligand InfoPC cidPC sidPDB
TargetTyrosine-protein kinase JAK2(Homo sapiens (Human))
Genentech
US Patent
LigandPNGBDBM50545973(CHEMBL4781423 | US11649241, Example 1)
Affinity DataKi:  4.70nM. Assay description: Inhibition of recombinant human JAK2 (812 to 1132 residues) expressed in insect cells using Y1-B as substrate incubated for 30 mins by microfluidic m...
Ligand InfoPC cidPC sidPDB
In DepthDetails ArticlePubMed
LigandPNGBDBM50545973(CHEMBL4781423 | US11649241, Example 1)
Affinity DataIC50:  93nM. Assay description: Inhibition of JAK in human BEAS-2B cells assessed as reduction in IL13-induced STAT6 phosphorylation incubated for 1 hr followed by IL13 addition and...
Ligand InfoPC cidPC sidPDB