BDBM50547934 CHEMBL4757930
SMILES CC(C)C[C@H](N)C(=O)N[C@H]1CCN[C@](CCCCB(O)O)(C1)C(O)=O
InChI Key InChIKey=WURKOUVKKRCCNK-HEHGZKQESA-N
Data  2 IC50
  Tab Delimited (TSV)   2D SDfile   Computed 3D by Vconf -m prep SDfile
Find this compound or compounds like it in BindingDB:
Activity Spreadsheet -- Enzyme Inhibition Constant Data from BindingDB
Found 2 hits for monomerid = 50547934
TargetArginase-2, mitochondrial(Homo sapiens (Human))
Smith, Gambrell & Russell
Curated by ChEMBL
LigandPNGBDBM50547934(CHEMBL4757930)
Affinity DataIC50:  15nM. Assay description: Inhibition of human recombinant arginase 2 expressed in Escherichia coli using thioarginine by Ellman's assay
Ligand InfoPC cidPC sid
In DepthDetails ArticlePubMed
TargetArginase-1(Homo sapiens (Human))
Smith, Gambrell & Russell
Curated by ChEMBL
LigandPNGBDBM50547934(CHEMBL4757930)
Affinity DataIC50:  18nM. Assay description: Inhibition of human recombinant arginase 1 expressed in Escherichia coli using thioarginine by Ellman's assay
Ligand InfoPC cidPC sid
In DepthDetails ArticlePubMed