BDBM50564137 CHEMBL4796488
SMILES NS(=O)(=O)c1ccc(CCN(Cc2ccc(cc2)C#N)C(=O)Cn2cc(F)c(=O)[nH]c2=O)cc1
InChI Key InChIKey=IACNOHMVCYOORU-UHFFFAOYSA-N
Data  4 KI
  Tab Delimited (TSV)   2D SDfile   Computed 3D by Vconf -m prep SDfile
Find this compound or compounds like it in BindingDB:
Activity Spreadsheet -- Enzyme Inhibition Constant Data from BindingDB
Found 4 hits for monomerid = 50564137
TargetCarbonic anhydrase 2(Homo sapiens (Human))
University Of Florence
Curated by ChEMBL
LigandPNGBDBM50564137(CHEMBL4796488)
Affinity DataKi:  0.710nM. Assay description: Inhibition of recombinant human CA2 pre-incubated for 15 mins measured by phenol red dye based stopped flow CO2 hydration assay
Ligand InfoPC cidPC sid
In DepthDetails ArticlePubMed
TargetCarbonic anhydrase 9(Homo sapiens (Human))
University Of Florence
Curated by ChEMBL
LigandPNGBDBM50564137(CHEMBL4796488)
Affinity DataKi:  4.90nM. Assay description: Inhibition of recombinant human CA9 pre-incubated for 15 mins measured by phenol red dye based stopped flow CO2 hydration assay
Ligand InfoPC cidPC sid
In DepthDetails ArticlePubMed
TargetCarbonic anhydrase 12(Homo sapiens (Human))
University Of Florence
Curated by ChEMBL
LigandPNGBDBM50564137(CHEMBL4796488)
Affinity DataKi:  29nM. Assay description: Inhibition of recombinant human CA12 pre-incubated for 15 mins measured by phenol red dye based stopped flow CO2 hydration assay
Ligand InfoPC cidPC sid
In DepthDetails ArticlePubMed
TargetCarbonic anhydrase 1(Homo sapiens (Human))
University Of Florence
Curated by ChEMBL
LigandPNGBDBM50564137(CHEMBL4796488)
Affinity DataKi:  384nM. Assay description: Inhibition of recombinant human CA1 pre-incubated for 15 mins measured by phenol red dye based stopped flow CO2 hydration assay
Ligand InfoPC cidPC sid
In DepthDetails ArticlePubMed