BDBM50564456 CHEMBL4799631
SMILES CCN(CC)CCNC(=O)c1c(C)[nH]c(\C=C2/C(=O)Nc3ccc(CCOC(C)=O)cc23)c1C
InChI Key InChIKey=NICPYYDKEPDTPW-QNGOZBTKSA-N
Data  2 IC50
  Tab Delimited (TSV)   2D SDfile   Computed 3D by Vconf -m prep SDfile
Find this compound or compounds like it in BindingDB:
Activity Spreadsheet -- Enzyme Inhibition Constant Data from BindingDB
Found 2 hits for monomerid = 50564456
Target5'-AMP-activated protein kinase catalytic subunit alpha-2(Homo sapiens (Human))
University Of Colorado Anschutz Medical Campus
Curated by ChEMBL
LigandPNGBDBM50564456(CHEMBL4799631)
Affinity DataIC50:  111nM. Assay description: Inhibition of recombinant human His6-tagged AMPK alpha2 using ULight CRBtide as substrate incubated for 1 hr followed by substrate addition and measu...
Ligand InfoPC cidPC sid
In DepthDetails ArticlePubMed
Target5'-AMP-activated protein kinase catalytic subunit alpha-1(Homo sapiens (Human))
University Of Colorado Anschutz Medical Campus
Curated by ChEMBL
LigandPNGBDBM50564456(CHEMBL4799631)
Affinity DataIC50:  418nM. Assay description: Inhibition of recombinant human His6-tagged AMPK alpha1 using ULight CRBtide as substrate incubated for 1 hr followed by substrate addition and measu...
Ligand InfoPC cidPC sid
In DepthDetails ArticlePubMed