BDBM50575861 CHEMBL4874191
SMILES OC(=O)CCc1nc(c(o1)-c1cc(Cl)cc(Cl)c1)-c1ccccc1
InChI Key InChIKey=MNBKLGOJIXFSTI-UHFFFAOYSA-N
Data  3 EC50
PDB links: 1 PDB ID matches this monomer.
  Tab Delimited (TSV)   2D SDfile   Computed 3D by Vconf -m prep SDfile
Find this compound or compounds like it in BindingDB:
Activity Spreadsheet -- Enzyme Inhibition Constant Data from BindingDB
Found 3 hits for monomerid = 50575861
TargetRetinoic acid receptor RXR-alpha(Homo sapiens (Human))
Goethe-University Frankfurt
Curated by ChEMBL
LigandPNGBDBM50575861(CHEMBL4874191)
Affinity DataEC50:  60nM. Assay description: Agonist activity at human RXRalpha transfected in human HEK293T cells co-expressing pFR/pRL-Luc incubated for 14 to 16 hrs by hybrid reporter gene as...
Ligand InfoPC cidPC sidPDB
TargetRetinoic acid receptor RXR-gamma(Homo sapiens (Human))
Goethe-University Frankfurt
Curated by ChEMBL
LigandPNGBDBM50575861(CHEMBL4874191)
Affinity DataEC50:  200nM. Assay description: Agonist activity at human RXRgamma transfected in human HEK293T cells co-expressing pFR/pRL-Luc incubated for 14 to 16 hrs by hybrid reporter gene as...
Ligand InfoPC cidPC sidPDB
TargetRetinoic acid receptor RXR-beta(Homo sapiens (Human))
Goethe-University Frankfurt
Curated by ChEMBL
LigandPNGBDBM50575861(CHEMBL4874191)
Affinity DataEC50:  50nM. Assay description: Agonist activity at human RXRbeta transfected in human HEK293T cells co-expressing pFR/pRL-Luc incubated for 14 to 16 hrs by hybrid reporter gene ass...
Ligand InfoPC cidPC sidPDB