BDBM50578689 CHEMBL4855309
SMILES O=C(CNC(=O)c1ccnc2ccccc12)N1CCC[C@H]1C(=O)C(=O)NCc1ccccc1
InChI Key InChIKey=LRRXDWPKULAMMR-NRFANRHFSA-N
Data  1 IC50
  Tab Delimited (TSV)   2D SDfile   Computed 3D by Vconf -m prep SDfile
Find this compound or compounds like it in BindingDB:
Activity Spreadsheet -- Enzyme Inhibition Constant Data from BindingDB
Found 1 hit for monomerid = 50578689
TargetAcyl-protein thioesterase 1(Rattus norvegicus)
The Czech Academy Of Sciences
Curated by ChEMBL
LigandPNGBDBM50578689(CHEMBL4855309)
Affinity DataIC50:  0.770nM. Assay description: Inhibition of SF-tagged FAP (unknown origin) expressed in Drosophila S2 cells using fluorogenic substrate by spectrometric analysis
Ligand InfoPC cidPC sid
In DepthDetails ArticlePubMed