BDBM50578690 CHEMBL4850601
SMILES COc1cccc(CNC(=O)C(=O)[C@@H]2CCCN2C(=O)CNC(=O)c2ccnc3ccccc23)c1
InChI Key InChIKey=OROMXIOZKIWCLK-QFIPXVFZSA-N
Data  1 IC50
  Tab Delimited (TSV)   2D SDfile   Computed 3D by Vconf -m prep SDfile
Find this compound or compounds like it in BindingDB:
Activity Spreadsheet -- Enzyme Inhibition Constant Data from BindingDB
Found 1 hit for monomerid = 50578690
TargetAcyl-protein thioesterase 1(Rattus norvegicus)
The Czech Academy Of Sciences
Curated by ChEMBL
LigandPNGBDBM50578690(CHEMBL4850601)
Affinity DataIC50:  0.220nM. Assay description: Inhibition of SF-tagged FAP (unknown origin) expressed in Drosophila S2 cells using fluorogenic substrate by spectrometric analysis
Ligand InfoPC cidPC sid
In DepthDetails ArticlePubMed