BDBM50578708 CHEMBL4878759
SMILES CC(C)(C)OC(=O)CNC(=O)C(=O)[C@@H]1CCCN1C(=O)CNC(=O)c1ccnc2ccccc12
InChI Key InChIKey=RTTFNCLHEGUOEO-SFHVURJKSA-N
Data  2 IC50
  Tab Delimited (TSV)   2D SDfile   Computed 3D by Vconf -m prep SDfile
Find this compound or compounds like it in BindingDB:
Activity Spreadsheet -- Enzyme Inhibition Constant Data from BindingDB
Found 2 hits for monomerid = 50578708
TargetDipeptidyl peptidase 4(Homo sapiens (Human))
The Czech Academy Of Sciences
Curated by ChEMBL
LigandPNGBDBM50578708(CHEMBL4878759)
Affinity DataIC50: >3.00E+3nM. Assay description: Inhibition of SF-tagged DPP4 (unknown origin) expressed in Drosophila S2 cells using fluorogenic substrate by spectrometric analysis
Ligand InfoPC cidPC sid
In DepthDetails ArticlePubMed
TargetAcyl-protein thioesterase 1(Rattus norvegicus)
The Czech Academy Of Sciences
Curated by ChEMBL
LigandPNGBDBM50578708(CHEMBL4878759)
Affinity DataIC50:  0.130nM. Assay description: Inhibition of SF-tagged FAP (unknown origin) expressed in Drosophila S2 cells using fluorogenic substrate by spectrometric analysis
Ligand InfoPC cidPC sid
In DepthDetails ArticlePubMed