BDBM50578712 CHEMBL4869146
SMILES O=C(CNC(=O)C(=O)[C@@H]1CCCN1C(=O)CNC(=O)c1ccnc2ccccc12)N1CCCC1
InChI Key InChIKey=OTDIBMKFZUQYHI-IBGZPJMESA-N
Data  1 IC50
  Tab Delimited (TSV)   2D SDfile   Computed 3D by Vconf -m prep SDfile
Find this compound or compounds like it in BindingDB:
Activity Spreadsheet -- Enzyme Inhibition Constant Data from BindingDB
Found 1 hit for monomerid = 50578712
TargetAcyl-protein thioesterase 1(Rattus norvegicus)
The Czech Academy Of Sciences
Curated by ChEMBL
LigandPNGBDBM50578712(CHEMBL4869146)
Affinity DataIC50:  1.80nM. Assay description: Inhibition of SF-tagged FAP (unknown origin) expressed in Drosophila S2 cells using fluorogenic substrate by spectrometric analysis
Ligand InfoPC cidPC sid
In DepthDetails ArticlePubMed