BDBM568474 US11420984, Example 24
SMILES CN[C@H]1CN[C@@](CCCCB(O)O)(C1)C(O)=O
InChI Key InChIKey=ZTMVVJWAPCKKKN-SCZZXKLOSA-N
Data  2 IC50
  Tab Delimited (TSV)   2D SDfile   Computed 3D by Vconf -m prep SDfile
Find this compound or compounds like it in BindingDB:
Activity Spreadsheet -- Enzyme Inhibition Constant Data from BindingDB
Found 2 hits for monomerid = 568474
TargetArginase-2, mitochondrial(Homo sapiens (Human))
Astrazeneca
US Patent
LigandPNGBDBM568474(US11420984, Example 24)
Affinity DataIC50:  10nM. Assay description: The inhibitory effects of Examples 1 to 30 on the activity of Human Arginase 1 and Arginase 2 activity were quantified by measuring the formation of ...
Ligand InfoPC cidPC sid
In DepthDetails US Patent
TargetArginase-1(Homo sapiens (Human))
Astrazeneca
US Patent
LigandPNGBDBM568474(US11420984, Example 24)
Affinity DataIC50: <3nM. Assay description: The inhibitory effects of Examples 1 to 30 on the activity of Human Arginase 1 and Arginase 2 activity were quantified by measuring the formation of ...
Ligand InfoPC cidPC sid
In DepthDetails US Patent