BDBM91898 Chk1_32
SMILES Clc1ccc(OC2Cc3ccccc3C2)c(NC(=O)Nc2cnc(cn2)C#N)c1
InChI Key InChIKey=ISVZNMLDPUVNPP-UHFFFAOYSA-N
Data  1 KI  1 IC50
  Tab Delimited (TSV)   2D SDfile   Computed 3D by Vconf -m prep SDfile
Find this compound or compounds like it in BindingDB:
Activity Spreadsheet -- Enzyme Inhibition Constant Data from BindingDB
Found 2 hits for monomerid = 91898
TargetSerine/threonine-protein kinase Chk1 [2-280](Homo sapiens (Human))
D3R/Abbott
LigandPNGBDBM91898(Chk1_32)
Affinity DataKi: >1.00E+4nM. Assay description: 33P-Radiometric_Method1
Ligand InfoPC cidPC sid
In DepthDetails PubMed
TargetSerine/threonine-protein kinase Chk1(Homo sapiens (Human))
Csar
LigandPNGBDBM91898(Chk1_32)
Affinity DataIC50:  1.00E+4nM. Assay description: Abbott Kinase Enzymatics_CHK1/289 CDC25c - IC50(uM) (IC50)
Ligand InfoPC cidPC sid
In DepthDetails PubMed