BDBM92017 erk000310
SMILES Cc1cnc(NC2CCCCC2)nc1-c1c[nH]c(c1)C(=O)NCc1ccc(F)c(F)c1
InChI Key InChIKey=YGIRJVLFRYBTBK-UHFFFAOYSA-N
Data  2 KI
  Tab Delimited (TSV)   2D SDfile   Computed 3D by Vconf -m prep SDfile
Find this compound or compounds like it in BindingDB:
Activity Spreadsheet -- Enzyme Inhibition Constant Data from BindingDB
Found 1 hit for monomerid = 92017
TargetMitogen-activated protein kinase 1(Homo sapiens (Human))
Csar
LigandPNGBDBM92017(erk000310)
Affinity DataKi:  71nM. Assay description: Assay 1 ...
In DepthDetails PubMed